Reaction Details
TargetSphingosine 1-phosphate receptor 1
LigandBDBM50198839
Substrate/Competitorn/a
Meas. Tech.ChEMBL_432835 (CHEMBL914103)
EC50 33±n/a nM
Citation Foss, FWSnyder, AHDavis, MDRouse, MOkusa, MDLynch, KRMacdonald, TL Synthesis and biological evaluation of gamma-aminophosphonates as potent, subtype-selective sphingosine 1-phosphate receptor agonists and antagonists. Bioorg Med Chem15:663-77 (2006) 
 
Sphingosine 1-phosphate receptor 1
Name:Sphingosine 1-phosphate receptor 1
Type:Enzyme
Mol. Mass.:42836.02
Organism:Homo sapiens (Human)
Description:P21453
Residue:382
BDBM50198839
NameBDBM50198839
Synonyms:CHEMBL228137 | [3-hydroxy-4-(4-octylphenoxy)-butyl]-phosphonic acid
TypeSmall organic molecule
Emp. Form.C18H31O5P
Mol. Mass.358.4095
SMILESCCCCCCCCc1ccc(OC[C@@H](O)CCP(O)(O)=O)cc1