Reaction Details
TargetSphingosine 1-phosphate receptor 3
LigandBDBM50133425
Substrate/Competitorn/a
Meas. Tech.ChEMBL_432846 (CHEMBL915595)
Ki 300±n/a nM
Citation Foss, FWSnyder, AHDavis, MDRouse, MOkusa, MDLynch, KRMacdonald, TL Synthesis and biological evaluation of gamma-aminophosphonates as potent, subtype-selective sphingosine 1-phosphate receptor agonists and antagonists. Bioorg Med Chem15:663-77 (2006) 
 
Sphingosine 1-phosphate receptor 3
Name:Sphingosine 1-phosphate receptor 3
Type:G Protein-Coupled Receptor (GPCR)
Mol. Mass.:42278.13
Organism:Homo sapiens (Human)
Description:Q99500
Residue:378
BDBM50133425
NameBDBM50133425
Synonyms:CHEMBL227371 Phosphoric acid mono-[(R)-2-amino-2-(4-octyl-phenylcarbamoyl)-ethyl] ester; TFA
TypeSmall organic molecule
Emp. Form.C17H29N2O5P
Mol. Mass.372.3963
SMILESCCCCCCCCc1ccc(NC(=O)[C@H](N)COP(O)(O)=O)cc1