Reaction Details
TargetPotassium voltage-gated channel subfamily A member 5
LigandBDBM50199065
Substrate/Competitorn/a
Meas. Tech.ChEMBL_411693 (CHEMBL913527)
IC50 190±n/a nM
Citation Trotter, BWNanda, KKKett, NRRegan, CPLynch, JJStump, GLKiss, LWang, JSpencer, RHKane, SAWhite, RBZhang, RAnderson, KDLiverton, NJMcIntyre, CJBeshore, DCHartman, GDDinsmore, CJ Design and synthesis of novel isoquinoline-3-nitriles as orally bioavailable Kv1.5 antagonists for the treatment of atrial fibrillation. J Med Chem49:6954-7 (2006) 
 
Potassium voltage-gated channel subfamily A member 5
Name:Potassium voltage-gated channel subfamily A member 5
Type:Enzyme
Mol. Mass.:67222.47
Organism:Homo sapiens (Human)
Description:P22460
Residue:613
BDBM50199065
NameBDBM50199065
Synonyms:3-((dimethylamino)methyl)-6-methoxy-2-methyl-4-phenylisoquinolin-1(2H)-one | CHEMBL214742
TypeSmall organic molecule
Emp. Form.C20H22N2O2
Mol. Mass.322.4009
SMILESCOc1ccc2c(c1)c(-c1ccccc1)c(CN(C)C)n(C)c2=O