Reaction Details
TargetSodium-dependent serotonin transporter
LigandBDBM50126815
Substrate/Competitorn/a
Meas. Tech.ChEMBL_458902 (CHEMBL923873)
Ki 205±n/a nM
Citation Gilbert, KMBoos, TLDersch, CMGreiner, EJacobson, AELewis, DMatecka, DPrisinzano, TEZhang, YRothman, RBRice, KCVenanzi, CA DAT/SERT selectivity of flexible GBR 12909 analogs modeled using 3D-QSAR methods. Bioorg Med Chem15:1146-59 (2006) 
 
Sodium-dependent serotonin transporter
Name:Sodium-dependent serotonin transporter
Type:Multi-pass membrane protein
Mol. Mass.:70168.43
Organism:Rattus norvegicus (rat)
Description:P31652
Residue:630
BDBM50126815
NameBDBM50126815
Synonyms:1-(4-iodobenzyl)-4-(2-(bis(4-fluorophenyl)methoxy)ethyl)piperidine CHEMBL284096
TypeSmall organic molecule
Emp. Form.C27H28F2INO
Mol. Mass.547.4186
SMILESFc1ccc(cc1)C(OCCC1CCN(Cc2ccc(I)cc2)CC1)c1ccc(F)cc1