Reaction Details
TargetSodium-dependent serotonin transporter
LigandBDBM50126352
Substrate/Competitorn/a
Meas. Tech.ChEMBL_458902 (CHEMBL923873)
Ki 3±n/a nM
Citation Gilbert, KMBoos, TLDersch, CMGreiner, EJacobson, AELewis, DMatecka, DPrisinzano, TEZhang, YRothman, RBRice, KCVenanzi, CA DAT/SERT selectivity of flexible GBR 12909 analogs modeled using 3D-QSAR methods. Bioorg Med Chem15:1146-59 (2006) 
 
Sodium-dependent serotonin transporter
Name:Sodium-dependent serotonin transporter
Type:Multi-pass membrane protein
Mol. Mass.:70168.43
Organism:Rattus norvegicus (rat)
Description:P31652
Residue:630
BDBM50126352
NameBDBM50126352
Synonyms:(1R,2S)-2-((4-(2-(bis(4-fluorophenyl)methoxy)ethyl)piperazin-1-yl)methyl)-6-methoxy-1,2,3,4-tetrahydronaphthalen-1-ol CHEMBL286949
TypeSmall organic molecule
Emp. Form.C31H36F2N2O3
Mol. Mass.522.6259
SMILESCOc1ccc2[C@H](O)[C@H](CN3CCN(CCOC(c4ccc(F)cc4)c4ccc(F)cc4)CC3)CCc2c1