Reaction Details
TargetSodium-dependent dopamine transporter
LigandBDBM50126815
Substrate/Competitorn/a
Meas. Tech.ChEMBL_458901 (CHEMBL923872)
Ki 2.1±n/a nM
Citation Gilbert, KMBoos, TLDersch, CMGreiner, EJacobson, AELewis, DMatecka, DPrisinzano, TEZhang, YRothman, RBRice, KCVenanzi, CA DAT/SERT selectivity of flexible GBR 12909 analogs modeled using 3D-QSAR methods. Bioorg Med Chem15:1146-59 (2006) 
 
Sodium-dependent dopamine transporter
Name:Sodium-dependent dopamine transporter
Type:Multi-pass membrane protein
Mol. Mass.:68749.45
Organism:Rattus norvegicus (rat)
Description:P23977
Residue:619
BDBM50126815
NameBDBM50126815
Synonyms:1-(4-iodobenzyl)-4-(2-(bis(4-fluorophenyl)methoxy)ethyl)piperidine CHEMBL284096
TypeSmall organic molecule
Emp. Form.C27H28F2INO
Mol. Mass.547.4186
SMILESFc1ccc(cc1)C(OCCC1CCN(Cc2ccc(I)cc2)CC1)c1ccc(F)cc1