Reaction Details
TargetHistamine H3 receptor
LigandBDBM50200627
Substrate/Competitorn/a
Meas. Tech.ChEMBL_453775 (CHEMBL885776)
Ki 12.5±n/a nM
Citation Black, LANersesian, DLSharma, PKu, YYBennani, YLMarsh, KCMiller, TREsbenshade, TAHancock, AACowart, M 4-[6-(2-Aminoethyl)naphthalen-2-yl]benzonitriles are potent histamine H3 receptor antagonists with high CNS penetration. Bioorg Med Chem Lett17:1443-6 (2007) 
 
Histamine H3 receptor
Name:Histamine H3 receptor
Type:G Protein-Coupled Receptor (GPCR)
Mol. Mass.:48607.98
Organism:Rattus norvegicus (rat)
Description:n/a
Residue:445
BDBM50200627
NameBDBM50200627
Synonyms:4-(6-(2-(diethylamino)ethyl)naphthalen-2-yl)benzonitrile | CHEMBL246317
TypeSmall organic molecule
Emp. Form.C23H24N2
Mol. Mass.328.4501
SMILESCCN(CC)CCc1ccc2cc(ccc2c1)-c1ccc(cc1)C#N