Reaction Details
TargetHistamine H3 receptor
LigandBDBM50200628
Substrate/Competitorn/a
Meas. Tech.ChEMBL_453774 (CHEMBL885775)
Ki 1.09±n/a nM
Citation Black, LANersesian, DLSharma, PKu, YYBennani, YLMarsh, KCMiller, TREsbenshade, TAHancock, AACowart, M 4-[6-(2-Aminoethyl)naphthalen-2-yl]benzonitriles are potent histamine H3 receptor antagonists with high CNS penetration. Bioorg Med Chem Lett17:1443-6 (2007) 
 
Histamine H3 receptor
Name:Histamine H3 receptor
Type:G Protein-Coupled Receptor (GPCR)
Mol. Mass.:48691.47
Organism:Homo sapiens (Human)
Description:Binding assays were using CHO cells stably expressing hH3R receptors.
Residue:445
BDBM50200628
NameBDBM50200628
Synonyms:4-(6-(2-(tert-butyl(methyl)amino)ethyl)naphthalen-2-yl)benzonitrile | CHEMBL394898
TypeSmall organic molecule
Emp. Form.C24H26N2
Mol. Mass.342.4766
SMILESCN(CCc1ccc2cc(ccc2c1)-c1ccc(cc1)C#N)C(C)(C)C