Reaction Details
TargetHistamine H3 receptor
LigandBDBM50200648
Substrate/Competitorn/a
Meas. Tech.ChEMBL_453774 (CHEMBL885775)
Ki 1.56±n/a nM
Citation Black, LANersesian, DLSharma, PKu, YYBennani, YLMarsh, KCMiller, TREsbenshade, TAHancock, AACowart, M 4-[6-(2-Aminoethyl)naphthalen-2-yl]benzonitriles are potent histamine H3 receptor antagonists with high CNS penetration. Bioorg Med Chem Lett17:1443-6 (2007) 
 
Histamine H3 receptor
Name:Histamine H3 receptor
Type:G Protein-Coupled Receptor (GPCR)
Mol. Mass.:48691.47
Organism:Homo sapiens (Human)
Description:Binding assays were using CHO cells stably expressing hH3R receptors.
Residue:445
BDBM50200648
NameBDBM50200648
Synonyms:(R)-4-(6-(2-(3-hydroxypyrrolidin-1-yl)ethyl)naphthalen-2-yl)benzonitrile | CHEMBL393899
TypeSmall organic molecule
Emp. Form.C23H22N2O
Mol. Mass.342.4336
SMILESO[C@@H]1CCN(CCc2ccc3cc(ccc3c2)-c2ccc(cc2)C#N)C1