Reaction Details
TargetProlyl endopeptidase
LigandBDBM50200729
Substrate/Competitorn/a
Meas. Tech.ChEMBL_422119 (CHEMBL908233)
Ki 2.2±n/a nM
Citation Tran, TQuan, CEdosada, CYMayeda, MWiesmann, CSutherlin, DWolf, BB Synthesis and structure-activity relationship of N-acyl-Gly-, N-acyl-Sar- and N-blocked-boroPro inhibitors of FAP, DPP4, and POP. Bioorg Med Chem Lett17:1438-42 (2007) 
 
Prolyl endopeptidase
Name:Prolyl endopeptidase
Type:Enzyme
Mol. Mass.:80688.50
Organism:Homo sapiens (Human)
Description:P48147
Residue:710
BDBM50200729
NameBDBM50200729
Synonyms:(R)-1-(2-(2,5-dichlorobenzamido)acetyl)pyrrolidin-2-ylboronic acid | CHEMBL386890
TypeSmall organic molecule
Emp. Form.C13H15BCl2N2O4
Mol. Mass.344.986
SMILESOB(O)[C@@H]1CCCN1C(=O)CNC(=O)c1cc(Cl)ccc1Cl