Reaction Details
TargetAcetylcholinesterase
LigandBDBM29399
Substrate/Competitorn/a
Meas. Tech.ChEMBL_422675 (CHEMBL913361)
IC50 61±n/a nM
Citation Marco-Contelles, JLeón, Rde Los Ríos, CGuglietta, ATerencio, JLópez, MGGarcía, AGVillarroya, M Novel multipotent tacrine-dihydropyridine hybrids with improved acetylcholinesterase inhibitory and neuroprotective activities as potential drugs for the treatment of Alzheimer's disease. J Med Chem49:7607-10 (2006) 
 
Acetylcholinesterase
Name:Acetylcholinesterase
Type:Enzyme
Mol. Mass.:71812.79
Organism:Electrophorus electricus (Electric eel)
Description:n/a
Residue:633
BDBM29399
NameBDBM29399
Synonyms:CHEMBL218940 | tacrine-dihydropyridine hybrid (tacripyrine), 10
TypeSmall organic molecule
Emp. Form.C23H27N3O3
Mol. Mass.393.4788
SMILESCCOC(=O)C1C(c2cccc(OC)c2)c2c(N)c3CCCCc3nc2N=C1C