Reaction Details
TargetMuscarinic acetylcholine receptor M2
LigandBDBM50201294
Substrate/Competitorn/a
Meas. Tech.ChEMBL_441417 (CHEMBL891646)
Ki 2.4±n/a nM
Citation Sonda, SKatayama, KFujio, MSakashita, HInaba, KAsano, KAkira, T 1,5-Benzodioxepin derivatives as a novel class of muscarinic M3 receptor antagonists. Bioorg Med Chem Lett17:925-31 (2007) 
 
Muscarinic acetylcholine receptor M2
Name:Muscarinic acetylcholine receptor M2
Type:GPCR
Mol. Mass.:51730.61
Organism:Homo sapiens (Human)
Description:P08172
Residue:466
BDBM50201294
NameBDBM50201294
Synonyms:3-((2-cyclopentylethylamino)methyl)-N,N-dimethyl-3,4-dihydro-2H-benzo[b][1,4]dioxepin-3-amine | CHEMBL394254
TypeSmall organic molecule
Emp. Form.C19H30N2O2
Mol. Mass.318.4537
SMILESCN(C)C1(CNCCC2CCCC2)COc2ccccc2OC1