Reaction Details
TargetMuscarinic acetylcholine receptor M2
LigandBDBM50201296
Substrate/Competitorn/a
Meas. Tech.ChEMBL_441417 (CHEMBL891646)
Ki 1.9±n/a nM
Citation Sonda, SKatayama, KFujio, MSakashita, HInaba, KAsano, KAkira, T 1,5-Benzodioxepin derivatives as a novel class of muscarinic M3 receptor antagonists. Bioorg Med Chem Lett17:925-31 (2007) 
 
Muscarinic acetylcholine receptor M2
Name:Muscarinic acetylcholine receptor M2
Type:GPCR
Mol. Mass.:51730.61
Organism:Homo sapiens (Human)
Description:P08172
Residue:466
BDBM50201296
NameBDBM50201296
Synonyms:4-(2-((3-(dimethylamino)-3,4-dihydro-2H-benzo[b][1,4]dioxepin-3-yl)methylamino)ethyl)cyclohexanol | CHEMBL391977
TypeSmall organic molecule
Emp. Form.C20H32N2O3
Mol. Mass.348.4797
SMILESCN(C)C1(CNCCC2CCC(O)CC2)COc2ccccc2OC1