Reaction Details
TargetCarboxypeptidase N catalytic chain
LigandBDBM50201429
Substrate/Competitorn/a
Meas. Tech.ChEMBL_453906 (CHEMBL885910)
IC50 58±n/a nM
Citation Islam, IBryant, JMay, KMohan, RYuan, SKent, LMorser, JZhao, LVergona, RWhite, KAdler, MWhitlow, MBuckman, BO 3-Mercaptopropionic acids as efficacious inhibitors of activated thrombin activatable fibrinolysis inhibitor (TAFIa). Bioorg Med Chem Lett17:1349-54 (2007) 
 
Carboxypeptidase N catalytic chain
Name:Carboxypeptidase N catalytic chain
Type:PROTEIN
Mol. Mass.:52293.66
Organism:Homo sapiens (Human)
Description:ChEMBL_1496379
Residue:458
BDBM50201429
NameBDBM50201429
Synonyms:2-(1-carbamimidoylpiperidin-3-yl)-3-mercaptopropanoic acid | CHEMBL245589
TypeSmall organic molecule
Emp. Form.C9H17N3O2S
Mol. Mass.231.315
SMILESNC(=N)N1CCCC(C1)C(CS)C(O)=O