Reaction Details
TargetCarboxypeptidase B2
LigandBDBM50201435
Substrate/Competitorn/a
Meas. Tech.ChEMBL_453904 (CHEMBL885908)
IC50 139±n/a nM
Citation Islam, IBryant, JMay, KMohan, RYuan, SKent, LMorser, JZhao, LVergona, RWhite, KAdler, MWhitlow, MBuckman, BO 3-Mercaptopropionic acids as efficacious inhibitors of activated thrombin activatable fibrinolysis inhibitor (TAFIa). Bioorg Med Chem Lett17:1349-54 (2007) 
 
Carboxypeptidase B2
Name:Carboxypeptidase B2
Type:Enzyme
Mol. Mass.:48432.74
Organism:Homo sapiens (Human)
Description:Q96IY4
Residue:423
BDBM50201435
NameBDBM50201435
Synonyms:2-(mercaptomethyl)-3-(piperidin-4-yl)propanoic acid | CHEMBL391595
TypeSmall organic molecule
Emp. Form.C9H17NO2S
Mol. Mass.203.302
SMILESOC(=O)C(CS)CC1CCNCC1