Reaction Details
TargetCarboxypeptidase N catalytic chain
LigandBDBM50201434
Substrate/Competitorn/a
Meas. Tech.ChEMBL_453906 (CHEMBL885910)
IC50 1750±n/a nM
Citation Islam, IBryant, JMay, KMohan, RYuan, SKent, LMorser, JZhao, LVergona, RWhite, KAdler, MWhitlow, MBuckman, BO 3-Mercaptopropionic acids as efficacious inhibitors of activated thrombin activatable fibrinolysis inhibitor (TAFIa). Bioorg Med Chem Lett17:1349-54 (2007) 
 
Carboxypeptidase N catalytic chain
Name:Carboxypeptidase N catalytic chain
Type:PROTEIN
Mol. Mass.:52293.66
Organism:Homo sapiens (Human)
Description:ChEMBL_1496379
Residue:458
BDBM50201434
NameBDBM50201434
Synonyms:3-mercapto-2-(piperidin-3-yl)propanoic acid | CHEMBL245591
TypeSmall organic molecule
Emp. Form.C8H15NO2S
Mol. Mass.189.275
SMILESOC(=O)C(CS)C1CCCNC1