Reaction Details
TargetCarboxypeptidase B
LigandBDBM50201435
Substrate/Competitorn/a
Meas. Tech.ChEMBL_453905 (CHEMBL885909)
IC50 29±n/a nM
Citation Islam, IBryant, JMay, KMohan, RYuan, SKent, LMorser, JZhao, LVergona, RWhite, KAdler, MWhitlow, MBuckman, BO 3-Mercaptopropionic acids as efficacious inhibitors of activated thrombin activatable fibrinolysis inhibitor (TAFIa). Bioorg Med Chem Lett17:1349-54 (2007) 
 
Carboxypeptidase B
Name:Carboxypeptidase B
Type:PROTEIN
Mol. Mass.:47371.10
Organism:Sus scrofa
Description:ChEMBL_453905
Residue:416
BDBM50201435
NameBDBM50201435
Synonyms:2-(mercaptomethyl)-3-(piperidin-4-yl)propanoic acid | CHEMBL391595
TypeSmall organic molecule
Emp. Form.C9H17NO2S
Mol. Mass.203.302
SMILESOC(=O)C(CS)CC1CCNCC1