Reaction Details
TargetCarboxypeptidase N catalytic chain
LigandBDBM50201431
Substrate/Competitorn/a
Meas. Tech.ChEMBL_453906 (CHEMBL885910)
IC50 357±n/a nM
Citation Islam, IBryant, JMay, KMohan, RYuan, SKent, LMorser, JZhao, LVergona, RWhite, KAdler, MWhitlow, MBuckman, BO 3-Mercaptopropionic acids as efficacious inhibitors of activated thrombin activatable fibrinolysis inhibitor (TAFIa). Bioorg Med Chem Lett17:1349-54 (2007) 
 
Carboxypeptidase N catalytic chain
Name:Carboxypeptidase N catalytic chain
Type:PROTEIN
Mol. Mass.:52293.66
Organism:Homo sapiens (Human)
Description:ChEMBL_1496379
Residue:458
BDBM50201431
NameBDBM50201431
Synonyms:2-(3-aminophenyl)-3-mercaptopropanoic acid | CHEMBL246595
TypeSmall organic molecule
Emp. Form.C9H11NO2S
Mol. Mass.197.254
SMILESNc1cccc(c1)C(CS)C(O)=O