Reaction Details
TargetMetabotropic glutamate receptor 5
LigandBDBM50201500
Substrate/Competitorn/a
Meas. Tech.ChEMBL_453908 (CHEMBL885912)
Ki 2900±n/a nM
Citation Ceccarelli, SMJaeschke, GBuettelmann, BHuwyler, JKolczewski, SPeters, JUPrinssen, EPorter, RSpooren, WVieira, E Rational design, synthesis, and structure-activity relationship of benzoxazolones: new potent mglu5 receptor antagonists based on the fenobam structure. Bioorg Med Chem Lett17:1302-6 (2007) 
 
Metabotropic glutamate receptor 5
Name:Metabotropic glutamate receptor 5
Type:Enzyme
Mol. Mass.:132484.72
Organism:Homo sapiens (Human)
Description:n/a
Residue:1212
BDBM50201500
NameBDBM50201500
Synonyms:CHEMBL239595 | N-(3-chlorophenyl)-3-oxo-3,4-dihydro-2H-benzo[b][1,4]oxazine-5-carboxamide
TypeSmall organic molecule
Emp. Form.C15H11ClN2O3
Mol. Mass.302.712
SMILESClc1cccc(NC(=O)c2cccc3OCC(=O)Nc23)c1