Reaction Details
TargetAdenosine kinase
LigandBDBM50201834
Substrate/Competitorn/a
Meas. Tech.ChEMBL_435462 (CHEMBL903820)
IC50 100±n/a nM
Citation Matulenko, MAPaight, ESFrey, RRGomtsyan, ADiDomenico, SJiang, MLee, CHStewart, AOYu, HKohlhaas, KLAlexander, KMMcGaraughty, SMikusa, JMarsh, KCMuchmore, SWJakob, CLKowaluk, EAJarvis, MFBhagwat, SS 4-amino-5-aryl-6-arylethynylpyrimidines: structure-activity relationships of non-nucleoside adenosine kinase inhibitors. Bioorg Med Chem15:1586-605 (2007) 
 
Adenosine kinase
Name:Adenosine kinase
Type:PROTEIN
Mol. Mass.:40545.97
Organism:Homo sapiens (Human)
Description:ChEMBL_1467841
Residue:362
BDBM50201834
NameBDBM50201834
Synonyms:5-benzo[b]thiophen-2-yl-6-(6-morpholin-4-ylpyridin-3-ylethynyl)pyrimidin-4-ylamine | CHEMBL226486
TypeSmall organic molecule
Emp. Form.C23H19N5OS
Mol. Mass.413.495
SMILESNc1ncnc(C#Cc2ccc(nc2)N2CCOCC2)c1-c1cc2ccccc2s1