Reaction Details
TargetMu-type opioid receptor
LigandBDBM50202108
Substrate/Competitorn/a
Meas. Tech.ChEMBL_423421 (CHEMBL911096)
Ki 31±n/a nM
Citation Lee, YSAgnes, RSDavis, PMa, SWBadghisi, HLai, JPorreca, FHruby, VJ Partial retro-inverso, retro, and inverso modifications of hydrazide linked bifunctional peptides for opioid and cholecystokinin (CCK) receptors. J Med Chem50:165-8 (2007) 
 
Mu-type opioid receptor
Name:Mu-type opioid receptor
Type:G Protein-Coupled Receptor (GPCR)
Mol. Mass.:44503.11
Organism:Rattus norvegicus (rat)
Description:Competition binding assays were carried out using membrane preparations from transfected HN9.10 cells that constitutively expressed the mu opioid receptor.
Residue:398
BDBM50202108
NameBDBM50202108
Synonyms:(3S)-3-{[(2S)-1-[(2S)-2-{2-[(2R)-2-[(2S)-2-amino-3-(4-hydroxyphenyl)propanamido]propanamido]acetamido}-3-phenylpropanehydrazido]-1-oxo-3-phenylpropan-2-yl]carbamoyl}-3-[(2S)-2-[(2R)-2-{[(tert-butoxy)carbonyl]amino}-3-(1H-indol-2-yl)propanamido]hexanamido]propanoic acid | CHEMBL414087
TypeSmall organic molecule
Emp. Form.C58H73N11O13
Mol. Mass.1132.2661
SMILESCCCC[C@H](NC(=O)[C@@H](Cc1cc2ccccc2[nH]1)NC(=O)OC(C)(C)C)C(=O)N[C@@H](CC(O)=O)C(=O)N[C@@H](Cc1ccccc1)C(=O)NNC(=O)[C@H](Cc1ccccc1)NC(=O)CNC(=O)[C@@H](C)NC(=O)[C@@H](N)Cc1ccc(O)cc1