Reaction Details
TargetC-X-C chemokine receptor type 4
LigandBDBM50202365
Substrate/Competitorn/a
Meas. Tech.ChEMBL_423498 (CHEMBL911131)
IC50 23±n/a nM
Citation Ueda, SOishi, SWang, ZXAraki, TTamamura, HCluzeau, JOhno, HKusano, SNakashima, HTrent, JOPeiper, SCFujii, N Structure-activity relationships of cyclic peptide-based chemokine receptor CXCR4 antagonists: disclosing the importance of side-chain and backbone functionalities. J Med Chem50:192-8 (2007) 
 
C-X-C chemokine receptor type 4
Name:C-X-C chemokine receptor type 4
Type:Enzyme
Mol. Mass.:39754.61
Organism:Homo sapiens (Human)
Description:P61073
Residue:352
BDBM50202365
NameBDBM50202365
Synonyms:CHEMBL374421 | cyclo(-D-Tyr-L-MeArg-L-Arg-L-Nal-Gly-)
TypeSmall organic molecule
Emp. Form.C37H49N11O6
Mol. Mass.743.8551
SMILES[#6]-[#7]-1-[#6@@H](-[#6]-[#6]-[#6]\[#7]=[#6](\[#7])-[#7])-[#6](=O)-[#7]-[#6@H](-[#6]-c2ccc(-[#8])cc2)-[#6](=O)-[#7]-[#6]-[#6](=O)-[#7]-[#6@@H](-[#6]-c2ccc3ccccc3c2)-[#6](=O)-[#7]-[#6@@H](-[#6]-[#6]-[#6]\[#7]=[#6](\[#7])-[#7])-[#6]-1=O