Reaction Details
TargetMetabotropic glutamate receptor 2
LigandBDBM50074749
Substrate/Competitorn/a
Meas. Tech.ChEMBL_423515 (CHEMBL910533)
EC50 2.7±n/a nM
Citation Monn, JAMassey, SMValli, MJHenry, SSStephenson, GABures, MHérin, MCatlow, JGiera, DWright, RAJohnson, BGAndis, SLKingston, ASchoepp, DD Synthesis and metabotropic glutamate receptor activity of S-oxidized variants of (-)-4-amino-2-thiabicyclo-[3.1.0]hexane-4,6-dicarboxylate: identification of potent, selective, and orally bioavailable agonists for mGlu2/3 receptors. J Med Chem50:233-40 (2007) 
 
Metabotropic glutamate receptor 2
Name:Metabotropic glutamate receptor 2
Type:Enzyme
Mol. Mass.:95584.88
Organism:Homo sapiens (Human)
Description:Q14416
Residue:872
BDBM50074749
NameBDBM50074749
Synonyms:(1R,4R,5S,6R)-4-Amino-2-oxa-bicyclo[3.1.0]hexane-4,6-dicarboxylic acid CHEMBL275079 LY379268
TypeSmall organic molecule
Emp. Form.C7H9NO5
Mol. Mass.187.1501
SMILESN[C@]1(CO[C@H]2[C@@H]([C@@H]12)C(O)=O)C(O)=O