Reaction Details
TargetDelta-type opioid receptor
LigandBDBM50202498
Substrate/Competitorn/a
Meas. Tech.ChEMBL_423718 (CHEMBL855468)
Ki 0.48±n/a nM
Citation Tóth, GIoja, ETömböly, CBallet, STourwé, DPéter, AMartinek, TChung, NNSchiller, PWBenyhe, SBorsodi, A Beta-methyl substitution of cyclohexylalanine in Dmt-Tic-Cha-Phe peptides results in highly potent delta opioid antagonists. J Med Chem50:328-33 (2007) 
 
Delta-type opioid receptor
Name:Delta-type opioid receptor
Type:G Protein-Coupled Receptor (GPCR)
Mol. Mass.:40465.04
Organism:Rattus norvegicus (rat)
Description:Competition binding assays were using CHO-K1 cell membranes expressing the opioid receptor.
Residue:372
BDBM50202498
NameBDBM50202498
Synonyms:CHEMBL219482 | H-Dmt-Tic-(2S,3S)-beta-MeCha-Phe-OH
TypeSmall organic molecule
Emp. Form.C40H50N4O6
Mol. Mass.682.8482
SMILESC[C@H]([C@H](NC(=O)C1Cc2ccccc2CN1C(=O)[C@@H](N)Cc1c(C)cc(O)cc1C)C(=O)N[C@@H](Cc1ccccc1)C(O)=O)C1CCCCC1