Reaction Details
TargetDelta-type opioid receptor
LigandBDBM50202505
Substrate/Competitorn/a
Meas. Tech.ChEMBL_423718 (CHEMBL855468)
Ki 0.61±n/a nM
Citation Tóth, GIoja, ETömböly, CBallet, STourwé, DPéter, AMartinek, TChung, NNSchiller, PWBenyhe, SBorsodi, A Beta-methyl substitution of cyclohexylalanine in Dmt-Tic-Cha-Phe peptides results in highly potent delta opioid antagonists. J Med Chem50:328-33 (2007) 
 
Delta-type opioid receptor
Name:Delta-type opioid receptor
Type:G Protein-Coupled Receptor (GPCR)
Mol. Mass.:40465.04
Organism:Rattus norvegicus (rat)
Description:Competition binding assays were using CHO-K1 cell membranes expressing the opioid receptor.
Residue:372
BDBM50202505
NameBDBM50202505
Synonyms:CHEMBL197937 | H-Tyr-Tic-Cha-Phe-OH
TypeSmall organic molecule
Emp. Form.C37H44N4O6
Mol. Mass.640.7685
SMILESN[C@@H](Cc1ccc(O)cc1)C(=O)N1Cc2ccccc2CC1C(=O)N[C@@H](CC1CCCCC1)C(=O)N[C@@H](Cc1ccccc1)C(O)=O