Reaction Details
TargetAdenosine receptor A2a
LigandBDBM50202791
Substrate/Competitorn/a
Meas. Tech.ChEMBL_454055 (CHEMBL903246)
Ki 10±n/a nM
Citation Silverman, LSCaldwell, JPGreenlee, WJKiselgof, EMatasi, JJTulshian, DBArik, LFoster, CBertorelli, RMonopoli, AOngini, E 3H-[1,2,4]-Triazolo[5,1-i]purin-5-amine derivatives as adenosine A2A antagonists. Bioorg Med Chem Lett17:1659-62 (2007) 
 
Adenosine receptor A2a
Name:Adenosine receptor A2a
Type:G Protein-Coupled Receptor (GPCR)
Mol. Mass.:44716.46
Organism:Homo sapiens (Human)
Description:P29274
Residue:412
BDBM50202791
NameBDBM50202791
Synonyms:3-(2-(4-(4-(2-methoxyethoxy)phenyl)piperazin-1-yl)ethyl)-8-(2-(trifluoromethyl)phenyl)-3H-[1,2,4]triazolo[1,5-g]purin-5-amine | CHEMBL247900
TypeSmall organic molecule
Emp. Form.C28H30F3N9O2
Mol. Mass.581.5921
SMILESCOCCOc1ccc(cc1)N1CCN(CCn2cnc3c2nc(N)n2nc(nc32)-c2ccccc2C(F)(F)F)CC1