Reaction Details
TargetAdenosine receptor A2a
LigandBDBM50202790
Substrate/Competitorn/a
Meas. Tech.ChEMBL_454055 (CHEMBL903246)
Ki 0.7±n/a nM
Citation Silverman, LSCaldwell, JPGreenlee, WJKiselgof, EMatasi, JJTulshian, DBArik, LFoster, CBertorelli, RMonopoli, AOngini, E 3H-[1,2,4]-Triazolo[5,1-i]purin-5-amine derivatives as adenosine A2A antagonists. Bioorg Med Chem Lett17:1659-62 (2007) 
 
Adenosine receptor A2a
Name:Adenosine receptor A2a
Type:G Protein-Coupled Receptor (GPCR)
Mol. Mass.:44716.46
Organism:Homo sapiens (Human)
Description:P29274
Residue:412
BDBM50202790
NameBDBM50202790
Synonyms:8-(furan-2-yl)-3-(2-(4-(4-(2-methoxyethoxy)phenyl)piperidin-1-yl)ethyl)-3H-[1,2,4]triazolo[1,5-g]purin-5-amine | CHEMBL246054
TypeSmall organic molecule
Emp. Form.C26H30N8O3
Mol. Mass.502.5682
SMILESCOCCOc1ccc(cc1)C1CCN(CCn2cnc3c2nc(N)n2nc(nc32)-c2ccco2)CC1