Reaction Details
TargetB1 bradykinin receptor
LigandBDBM50203211
Substrate/Competitorn/a
Meas. Tech.ChEMBL_425210 (CHEMBL855156)
IC50 5.6±n/a nM
Citation D'Amico, DCAya, THuman, JFotsch, CChen, JJBiswas, KRiahi, BNorman, MHWilloughby, CAHungate, RReider, PJBiddlecome, GLester-Zeiner, DStaden, CVJohnson, EKamassah, AArik, LWang, JViswanadhan, VNGroneberg, RDZhan, JSuzuki, HToro, AMareska, DAClarke, DEHarvey, DMBurgess, LELaird, ERAskew, BNg, G Identification of a nonpeptidic and conformationally restricted bradykinin B1 receptor antagonist with anti-inflammatory activity. J Med Chem50:607-10 (2007) 
 
B1 bradykinin receptor
Name:B1 bradykinin receptor
Type:Enzyme
Mol. Mass.:40508.87
Organism:Homo sapiens (Human)
Description:P46663
Residue:353
BDBM50203211
NameBDBM50203211
Synonyms:(R)-3-(naphthalene-7-sulfonamido)-3-phenyl-N-((R)-5-(piperidin-1-ylmethyl)-2,3-dihydro-1H-inden-1-yl)propanamide | CHEMBL441188
TypeSmall organic molecule
Emp. Form.C34H37N3O3S
Mol. Mass.567.741
SMILESO=C(C[C@@H](NS(=O)(=O)c1ccc2ccccc2c1)c1ccccc1)N[C@@H]1CCc2cc(CN3CCCCC3)ccc12