Reaction Details
TargetCytochrome P450 2C9
LigandBDBM50203304
Substrate/Competitorn/a
Meas. Tech.ChEMBL_425258 (CHEMBL856834)
IC50>10000±n/a nM
Citation Liverton, NJBednar, RABednar, BButcher, JWClaiborne, CFClaremon, DACunningham, MDiLella, AGGaul, SLLibby, BELyle, EALynch, JJMcCauley, JAMosser, SDNguyen, KTStump, GLSun, HWang, HYergey, JKoblan, KS Identification and characterization of 4-methylbenzyl 4-[(pyrimidin-2-ylamino)methyl]piperidine-1-carboxylate, an orally bioavailable, brain penetrant NR2B selective N-methyl-D-aspartate receptor antagonist. J Med Chem50:807-19 (2007) 
 
Cytochrome P450 2C9
Name:Cytochrome P450 2C9
Type:Enzyme
Mol. Mass.:55636.33
Organism:Homo sapiens (Human)
Description:P11712
Residue:490
BDBM50203304
NameBDBM50203304
Synonyms:CHEMBL218547 | benzyl 4-[(1,3-thiazol-2-ylamino)methyl]piperidine-1-carboxylate
TypeSmall organic molecule
Emp. Form.C17H21N3O2S
Mol. Mass.331.433
SMILESO=C(OCc1ccccc1)N1CCC(CNc2nccs2)CC1