Reaction Details
TargetGlutamate receptor ionotropic, NMDA 2A
LigandBDBM50070788
Substrate/Competitorn/a
Meas. Tech.ChEMBL_425252 (CHEMBL856829)
IC50>20000±n/a nM
Citation Liverton, NJBednar, RABednar, BButcher, JWClaiborne, CFClaremon, DACunningham, MDiLella, AGGaul, SLLibby, BELyle, EALynch, JJMcCauley, JAMosser, SDNguyen, KTStump, GLSun, HWang, HYergey, JKoblan, KS Identification and characterization of 4-methylbenzyl 4-[(pyrimidin-2-ylamino)methyl]piperidine-1-carboxylate, an orally bioavailable, brain penetrant NR2B selective N-methyl-D-aspartate receptor antagonist. J Med Chem50:807-19 (2007) 
 
Glutamate receptor ionotropic, NMDA 2A
Name:Glutamate receptor ionotropic, NMDA 2A
Type:n/a
Mol. Mass.:165293.76
Organism:Homo sapiens (Human)
Description:n/a
Residue:1464
BDBM50070788
NameBDBM50070788
Synonyms:CHEMBL48029 [2-(4-Benzyloxy-phenyl)-ethyl]-pyridin-4-yl-amine
TypeSmall organic molecule
Emp. Form.C20H20N2O
Mol. Mass.304.3856
SMILESC(Cc1ccc(OCc2ccccc2)cc1)Nc1ccncc1