Reaction Details
TargetGlutamate receptor ionotropic, NMDA 2B
LigandBDBM50203307
Substrate/Competitorn/a
Meas. Tech.ChEMBL_425253 (CHEMBL856830)
Ki 3180±n/a nM
Citation Liverton, NJBednar, RABednar, BButcher, JWClaiborne, CFClaremon, DACunningham, MDiLella, AGGaul, SLLibby, BELyle, EALynch, JJMcCauley, JAMosser, SDNguyen, KTStump, GLSun, HWang, HYergey, JKoblan, KS Identification and characterization of 4-methylbenzyl 4-[(pyrimidin-2-ylamino)methyl]piperidine-1-carboxylate, an orally bioavailable, brain penetrant NR2B selective N-methyl-D-aspartate receptor antagonist. J Med Chem50:807-19 (2007) 
 
Glutamate receptor ionotropic, NMDA 2B
Name:Glutamate receptor ionotropic, NMDA 2B
Type:PROTEIN
Mol. Mass.:166375.46
Organism:Homo sapiens (Human)
Description:ChEMBL_1438829
Residue:1484
BDBM50203307
NameBDBM50203307
Synonyms:4-methylbenzyl 4-[2-(pyrimidin-2-ylamino)ethyl]piperidine-1-carboxylate | CHEMBL218478
TypeSmall organic molecule
Emp. Form.C20H26N4O
Mol. Mass.338.4466
SMILESCc1ccc(CC(=O)N2CCC(CCNc3ncccn3)CC2)cc1