Reaction Details
TargetGlutamate receptor ionotropic, NMDA 2B
LigandBDBM50203316
Substrate/Competitorn/a
Meas. Tech.ChEMBL_425253 (CHEMBL856830)
Ki 7400±n/a nM
Citation Liverton, NJBednar, RABednar, BButcher, JWClaiborne, CFClaremon, DACunningham, MDiLella, AGGaul, SLLibby, BELyle, EALynch, JJMcCauley, JAMosser, SDNguyen, KTStump, GLSun, HWang, HYergey, JKoblan, KS Identification and characterization of 4-methylbenzyl 4-[(pyrimidin-2-ylamino)methyl]piperidine-1-carboxylate, an orally bioavailable, brain penetrant NR2B selective N-methyl-D-aspartate receptor antagonist. J Med Chem50:807-19 (2007) 
 
Glutamate receptor ionotropic, NMDA 2B
Name:Glutamate receptor ionotropic, NMDA 2B
Type:PROTEIN
Mol. Mass.:166375.46
Organism:Homo sapiens (Human)
Description:ChEMBL_1438829
Residue:1484
BDBM50203316
NameBDBM50203316
Synonyms:4-methylbenzyl 4-[(pyrimidin-2-yloxy)methyl]piperidine-1-carboxylate | CHEMBL217915
TypeSmall organic molecule
Emp. Form.C19H23N3O3
Mol. Mass.341.4042
SMILESCc1ccc(COC(=O)N2CCC(COc3ncccn3)CC2)cc1