Reaction Details
TargetGlutamate receptor ionotropic, NMDA 2B
LigandBDBM50203318
Substrate/Competitorn/a
Meas. Tech.ChEMBL_425253 (CHEMBL856830)
Ki 2100±n/a nM
Citation Liverton, NJBednar, RABednar, BButcher, JWClaiborne, CFClaremon, DACunningham, MDiLella, AGGaul, SLLibby, BELyle, EALynch, JJMcCauley, JAMosser, SDNguyen, KTStump, GLSun, HWang, HYergey, JKoblan, KS Identification and characterization of 4-methylbenzyl 4-[(pyrimidin-2-ylamino)methyl]piperidine-1-carboxylate, an orally bioavailable, brain penetrant NR2B selective N-methyl-D-aspartate receptor antagonist. J Med Chem50:807-19 (2007) 
 
Glutamate receptor ionotropic, NMDA 2B
Name:Glutamate receptor ionotropic, NMDA 2B
Type:PROTEIN
Mol. Mass.:166375.46
Organism:Homo sapiens (Human)
Description:ChEMBL_1438829
Residue:1484
BDBM50203318
NameBDBM50203318
Synonyms:4-methylbenzyl 4-{[methyl(pyrimidin-2-yl)amino]methyl}-piperidine-1-carboxylate | CHEMBL218463
TypeSmall organic molecule
Emp. Form.C20H26N4O2
Mol. Mass.354.446
SMILESCN(CC1CCN(CC1)C(=O)OCc1ccc(C)cc1)c1ncccn1