Reaction Details
TargetCytochrome P450 3A4
LigandBDBM50203303
Substrate/Competitorn/a
Meas. Tech.ChEMBL_425259 (CHEMBL856835)
IC50 9100±n/a nM
Citation Liverton, NJBednar, RABednar, BButcher, JWClaiborne, CFClaremon, DACunningham, MDiLella, AGGaul, SLLibby, BELyle, EALynch, JJMcCauley, JAMosser, SDNguyen, KTStump, GLSun, HWang, HYergey, JKoblan, KS Identification and characterization of 4-methylbenzyl 4-[(pyrimidin-2-ylamino)methyl]piperidine-1-carboxylate, an orally bioavailable, brain penetrant NR2B selective N-methyl-D-aspartate receptor antagonist. J Med Chem50:807-19 (2007) 
 
Cytochrome P450 3A4
Name:Cytochrome P450 3A4
Type:Enzyme
Mol. Mass.:57349.57
Organism:Homo sapiens (Human)
Description:n/a
Residue:503
BDBM50203303
NameBDBM50203303
Synonyms:CHEMBL218067 | benzyl 4-[(pyridin-3-ylamino)methyl]piperidine-1-carboxylate
TypeSmall organic molecule
Emp. Form.C19H23N3O2
Mol. Mass.325.4048
SMILESO=C(OCc1ccccc1)N1CCC(CNc2cccnc2)CC1