Reaction Details
TargetCytochrome P450 3A4
LigandBDBM50203302
Substrate/Competitorn/a
Meas. Tech.ChEMBL_425259 (CHEMBL856835)
IC50 5100±n/a nM
Citation Liverton, NJBednar, RABednar, BButcher, JWClaiborne, CFClaremon, DACunningham, MDiLella, AGGaul, SLLibby, BELyle, EALynch, JJMcCauley, JAMosser, SDNguyen, KTStump, GLSun, HWang, HYergey, JKoblan, KS Identification and characterization of 4-methylbenzyl 4-[(pyrimidin-2-ylamino)methyl]piperidine-1-carboxylate, an orally bioavailable, brain penetrant NR2B selective N-methyl-D-aspartate receptor antagonist. J Med Chem50:807-19 (2007) 
 
Cytochrome P450 3A4
Name:Cytochrome P450 3A4
Type:Enzyme
Mol. Mass.:57349.57
Organism:Homo sapiens (Human)
Description:n/a
Residue:503
BDBM50203302
NameBDBM50203302
Synonyms:CHEMBL218068 | benzyl 4-[(pyrimidin-4-ylamino)methyl]piperidine-1-carboxylate
TypeSmall organic molecule
Emp. Form.C18H22N4O2
Mol. Mass.326.3929
SMILESO=C(OCc1ccccc1)N1CCC(CNc2ccncn2)CC1