Reaction Details
TargetPotassium voltage-gated channel subfamily H member 2
LigandBDBM50070788
Substrate/Competitorn/a
Meas. Tech.ChEMBL_425254 (CHEMBL856827)
IC50 130±n/a nM
Citation Liverton, NJBednar, RABednar, BButcher, JWClaiborne, CFClaremon, DACunningham, MDiLella, AGGaul, SLLibby, BELyle, EALynch, JJMcCauley, JAMosser, SDNguyen, KTStump, GLSun, HWang, HYergey, JKoblan, KS Identification and characterization of 4-methylbenzyl 4-[(pyrimidin-2-ylamino)methyl]piperidine-1-carboxylate, an orally bioavailable, brain penetrant NR2B selective N-methyl-D-aspartate receptor antagonist. J Med Chem50:807-19 (2007) 
 
Potassium voltage-gated channel subfamily H member 2
Name:Potassium voltage-gated channel subfamily H member 2
Type:Multi-pass membrane protein
Mol. Mass.:126672.65
Organism:Homo sapiens (Human)
Description:Q12809
Residue:1159
BDBM50070788
NameBDBM50070788
Synonyms:CHEMBL48029 [2-(4-Benzyloxy-phenyl)-ethyl]-pyridin-4-yl-amine
TypeSmall organic molecule
Emp. Form.C20H20N2O
Mol. Mass.304.3856
SMILESC(Cc1ccc(OCc2ccccc2)cc1)Nc1ccncc1