Reaction Details
TargetCytochrome P450 2D6
LigandBDBM50203300
Substrate/Competitorn/a
Meas. Tech.ChEMBL_425257 (CHEMBL856833)
IC50 1700±n/a nM
Citation Liverton, NJBednar, RABednar, BButcher, JWClaiborne, CFClaremon, DACunningham, MDiLella, AGGaul, SLLibby, BELyle, EALynch, JJMcCauley, JAMosser, SDNguyen, KTStump, GLSun, HWang, HYergey, JKoblan, KS Identification and characterization of 4-methylbenzyl 4-[(pyrimidin-2-ylamino)methyl]piperidine-1-carboxylate, an orally bioavailable, brain penetrant NR2B selective N-methyl-D-aspartate receptor antagonist. J Med Chem50:807-19 (2007) 
 
Cytochrome P450 2D6
Name:Cytochrome P450 2D6
Type:Protein
Mol. Mass.:55774.82
Organism:Homo sapiens (Human)
Description:P10635
Residue:497
BDBM50203300
NameBDBM50203300
Synonyms:CHEMBL220660 | benzyl 4-[(pyrazin-2-ylamino)methyl]piperidine-1-carboxylate
TypeSmall organic molecule
Emp. Form.C18H22N4O2
Mol. Mass.326.3929
SMILESO=C(OCc1ccccc1)N1CCC(CNc2cnccn2)CC1