Reaction Details
TargetCytochrome P450 2C9
LigandBDBM50203303
Substrate/Competitorn/a
Meas. Tech.ChEMBL_425258 (CHEMBL856834)
IC50 12000±n/a nM
Citation Liverton, NJBednar, RABednar, BButcher, JWClaiborne, CFClaremon, DACunningham, MDiLella, AGGaul, SLLibby, BELyle, EALynch, JJMcCauley, JAMosser, SDNguyen, KTStump, GLSun, HWang, HYergey, JKoblan, KS Identification and characterization of 4-methylbenzyl 4-[(pyrimidin-2-ylamino)methyl]piperidine-1-carboxylate, an orally bioavailable, brain penetrant NR2B selective N-methyl-D-aspartate receptor antagonist. J Med Chem50:807-19 (2007) 
 
Cytochrome P450 2C9
Name:Cytochrome P450 2C9
Type:Enzyme
Mol. Mass.:55636.33
Organism:Homo sapiens (Human)
Description:P11712
Residue:490
BDBM50203303
NameBDBM50203303
Synonyms:CHEMBL218067 | benzyl 4-[(pyridin-3-ylamino)methyl]piperidine-1-carboxylate
TypeSmall organic molecule
Emp. Form.C19H23N3O2
Mol. Mass.325.4048
SMILESO=C(OCc1ccccc1)N1CCC(CNc2cccnc2)CC1