Reaction Details
TargetGlutamate receptor ionotropic, NMDA 2B
LigandBDBM50203329
Substrate/Competitorn/a
Meas. Tech.ChEMBL_425253 (CHEMBL856830)
Ki 3100±n/a nM
Citation Liverton, NJBednar, RABednar, BButcher, JWClaiborne, CFClaremon, DACunningham, MDiLella, AGGaul, SLLibby, BELyle, EALynch, JJMcCauley, JAMosser, SDNguyen, KTStump, GLSun, HWang, HYergey, JKoblan, KS Identification and characterization of 4-methylbenzyl 4-[(pyrimidin-2-ylamino)methyl]piperidine-1-carboxylate, an orally bioavailable, brain penetrant NR2B selective N-methyl-D-aspartate receptor antagonist. J Med Chem50:807-19 (2007) 
 
Glutamate receptor ionotropic, NMDA 2B
Name:Glutamate receptor ionotropic, NMDA 2B
Type:PROTEIN
Mol. Mass.:166375.46
Organism:Homo sapiens (Human)
Description:ChEMBL_1438829
Residue:1484
BDBM50203329
NameBDBM50203329
Synonyms:CHEMBL438994 | N-benzyl-N'-cyano-4-[(pyrimidin-2-ylamino)methyl]piperidine-1-carboximidamide
TypeSmall organic molecule
Emp. Form.C19H24N8
Mol. Mass.364.4475
SMILESN#CN=C(NCc1ccccc1)NN1CCC(CNc2ncccn2)CC1