Reaction Details
TargetGlutamate receptor ionotropic, NMDA 2B
LigandBDBM50203304
Substrate/Competitorn/a
Meas. Tech.ChEMBL_425253 (CHEMBL856830)
Ki 122±n/a nM
Citation Liverton, NJBednar, RABednar, BButcher, JWClaiborne, CFClaremon, DACunningham, MDiLella, AGGaul, SLLibby, BELyle, EALynch, JJMcCauley, JAMosser, SDNguyen, KTStump, GLSun, HWang, HYergey, JKoblan, KS Identification and characterization of 4-methylbenzyl 4-[(pyrimidin-2-ylamino)methyl]piperidine-1-carboxylate, an orally bioavailable, brain penetrant NR2B selective N-methyl-D-aspartate receptor antagonist. J Med Chem50:807-19 (2007) 
 
Glutamate receptor ionotropic, NMDA 2B
Name:Glutamate receptor ionotropic, NMDA 2B
Type:PROTEIN
Mol. Mass.:166375.46
Organism:Homo sapiens (Human)
Description:ChEMBL_1438829
Residue:1484
BDBM50203304
NameBDBM50203304
Synonyms:CHEMBL218547 | benzyl 4-[(1,3-thiazol-2-ylamino)methyl]piperidine-1-carboxylate
TypeSmall organic molecule
Emp. Form.C17H21N3O2S
Mol. Mass.331.433
SMILESO=C(OCc1ccccc1)N1CCC(CNc2nccs2)CC1