Reaction Details
TargetCorticotropin-releasing factor receptor 1
LigandBDBM50203587
Substrate/Competitorn/a
Meas. Tech.ChEMBL_454261 (CHEMBL903444)
Ki 6.4±n/a nM
Citation Han, XCiviello, RPin, SSBurris, KBalanda, LAKnipe, JRen, SFiedler, TBrowman, KEMacci, RTaber, MTZhang, JDubowchik, GM An orally active corticotropin releasing factor 1 receptor antagonist from 8-aryl-1,3a,7,8-tetraaza-cyclopenta[a]indenes. Bioorg Med Chem Lett17:2026-30 (2007) 
 
Corticotropin-releasing factor receptor 1
Name:Corticotropin-releasing factor receptor 1
Type:Enzyme
Mol. Mass.:50744.31
Organism:Homo sapiens (Human)
Description:P34998
Residue:444
BDBM50203587
NameBDBM50203587
Synonyms:CHEMBL392655 | [8-(2-chloro-4,6-dimethyl-phenyl)-2-methyl-8H-1,3a,7,8-tetraaza-cyclopenta[a]inden-3-ylmethyl]-ethyl-phenethyl-amine
TypeSmall organic molecule
Emp. Form.C28H30ClN5
Mol. Mass.472.024
SMILESCCN(CCc1ccccc1)Cc1c(C)nc2n(-c3c(C)cc(C)cc3Cl)c3ncccc3n12