Reaction Details
TargetCorticotropin-releasing factor receptor 1
LigandBDBM50203609
Substrate/Competitorn/a
Meas. Tech.ChEMBL_454261 (CHEMBL903444)
Ki 11±n/a nM
Citation Han, XCiviello, RPin, SSBurris, KBalanda, LAKnipe, JRen, SFiedler, TBrowman, KEMacci, RTaber, MTZhang, JDubowchik, GM An orally active corticotropin releasing factor 1 receptor antagonist from 8-aryl-1,3a,7,8-tetraaza-cyclopenta[a]indenes. Bioorg Med Chem Lett17:2026-30 (2007) 
 
Corticotropin-releasing factor receptor 1
Name:Corticotropin-releasing factor receptor 1
Type:Enzyme
Mol. Mass.:50744.31
Organism:Homo sapiens (Human)
Description:P34998
Residue:444
BDBM50203609
NameBDBM50203609
Synonyms:CHEMBL247151 | allyl-[8-(2-chloro-4,6-dimethyl-phenyl)-2-methyl-8H-1,3a,7,8-tetraaza-cyclopenta[a]inden-3-ylmethyl]-propyl-amine
TypeSmall organic molecule
Emp. Form.C24H28ClN5
Mol. Mass.421.966
SMILESCCCN(CC=C)Cc1c(C)nc2n(-c3c(C)cc(C)cc3Cl)c3ncccc3n12