Reaction Details
TargetKiSS-1 receptor
LigandBDBM50203793
Substrate/Competitorn/a
Meas. Tech.ChEMBL_425686 (CHEMBL912002)
Ki 10000±n/a nM
Citation Orsini, MJKlein, MABeavers, MPConnolly, PJMiddleton, SAMayo, KH Metastin (KiSS-1) mimetics identified from peptide structure-activity relationship-derived pharmacophores and directed small molecule database screening. J Med Chem50:462-71 (2007) 
 
KiSS-1 receptor
Name:KiSS-1 receptor
Type:G Protein-Coupled Receptor (GPCR)
Mol. Mass.:42613.79
Organism:Homo sapiens (Human)
Description:Binding assay was performed using membranes from the CHO cell transfectants.
Residue:398
BDBM50203793
NameBDBM50203793
Synonyms:(2S)-2-[(2S)-2-[(2S)-2-{[(2S)-1-[(2S)-2-amino-4-methylpentanoyl]pyrrolidin-2-yl]formamido}-3-carbamoylpropanamido]-3-(4-hydroxyphenyl)propanamido]-N-[(1S)-1-{[(1S)-2-carbamoyl-1-{[(1S)-1-{[(1S)-1-[({[(1S)-1-{[(1S)-1-{[(1S)-1-carbamoyl-2-phenylethyl]carbamoyl}-3-phenylpropyl]carbamoyl}-3-methylbutyl]carbamoyl}methyl)carbamoyl]-2-phenylethyl]carbamoyl}-2-hydroxyethyl]carbamoyl}ethyl]carbamoyl}-2-(1H-indol-3-yl)ethyl]butanediamide | CHEMBL373854
TypeSmall organic molecule
Emp. Form.C82H106N18O18
Mol. Mass.1631.8288
SMILESCC(C)C[C@H](N)C(=O)N1CCC[C@H]1C(=O)N[C@@H](CC(N)=O)C(=O)N[C@@H](Cc1ccc(O)cc1)C(=O)N[C@@H](CC(N)=O)C(=O)N[C@@H](Cc1c[nH]c2ccccc12)C(=O)N[C@@H](CC(N)=O)C(=O)N[C@@H](CO)C(=O)N[C@@H](Cc1ccccc1)C(=O)NCC(=O)N[C@@H](CC(C)C)C(=O)N[C@@H](CCc1ccccc1)C(=O)N[C@@H](Cc1ccccc1)C(N)=O