Reaction Details
TargetKiSS-1 receptor
LigandBDBM50203812
Substrate/Competitorn/a
Meas. Tech.ChEMBL_425686 (CHEMBL912002)
Ki 3600±n/a nM
Citation Orsini, MJKlein, MABeavers, MPConnolly, PJMiddleton, SAMayo, KH Metastin (KiSS-1) mimetics identified from peptide structure-activity relationship-derived pharmacophores and directed small molecule database screening. J Med Chem50:462-71 (2007) 
 
KiSS-1 receptor
Name:KiSS-1 receptor
Type:G Protein-Coupled Receptor (GPCR)
Mol. Mass.:42613.79
Organism:Homo sapiens (Human)
Description:Binding assay was performed using membranes from the CHO cell transfectants.
Residue:398
BDBM50203812
NameBDBM50203812
Synonyms:CHEMBL221753 cid_8478
TypeSmall organic molecule
Emp. Form.C27H42NO2
Mol. Mass.412.6273
SMILESCC(C)(C)CC(C)(C)c1ccc(OCCOCC[N+](C)(C)Cc2ccccc2)cc1