Reaction Details
TargetC-C chemokine receptor type 8
LigandBDBM50203832
Substrate/Competitorn/a
Meas. Tech.ChEMBL_425772 (CHEMBL855762)
Ki 0.7±n/a nM
Citation Jenkins, TJGuan, BDai, MLi, GLightburn, TEHuang, SFreeze, BSBurdi, DFJacutin-Porte, SBennett, RChen, WMinor, CGhosh, SBlackburn, CGigstad, KMJones, MKolbeck, RYin, WSmith, SCardillo, DOcain, TDHarriman, GC Design, synthesis, and evaluation of naphthalene-sulfonamide antagonists of human CCR8. J Med Chem50:566-84 (2007) 
 
C-C chemokine receptor type 8
Name:C-C chemokine receptor type 8
Type:PROTEIN
Mol. Mass.:40855.53
Organism:Homo sapiens (Human)
Description:ChEMBL_454278
Residue:355
BDBM50203832
NameBDBM50203832
Synonyms:4-[4-(2-methyl-benzoylamino)-naphthalene-1-sulfonylamino]-piperidine-1-carboxylic acid methylamide | CHEMBL221865
TypeSmall organic molecule
Emp. Form.C25H28N4O4S
Mol. Mass.480.579
SMILESCNC(=O)N1CCC(CC1)NS(=O)(=O)c1ccc(NC(=O)c2ccccc2C)c2ccccc12