Reaction Details
TargetC-C chemokine receptor type 8
LigandBDBM50203866
Substrate/Competitorn/a
Meas. Tech.ChEMBL_425772 (CHEMBL855762)
Ki 5.21±n/a nM
Citation Jenkins, TJGuan, BDai, MLi, GLightburn, TEHuang, SFreeze, BSBurdi, DFJacutin-Porte, SBennett, RChen, WMinor, CGhosh, SBlackburn, CGigstad, KMJones, MKolbeck, RYin, WSmith, SCardillo, DOcain, TDHarriman, GC Design, synthesis, and evaluation of naphthalene-sulfonamide antagonists of human CCR8. J Med Chem50:566-84 (2007) 
 
C-C chemokine receptor type 8
Name:C-C chemokine receptor type 8
Type:PROTEIN
Mol. Mass.:40855.53
Organism:Homo sapiens (Human)
Description:ChEMBL_454278
Residue:355
BDBM50203866
NameBDBM50203866
Synonyms:4-(4-o-tolylcarbamoyl-naphthalene-1-sulfonylamino)-piperidine-1-carboxylic acid ethyl ester | CHEMBL375315
TypeSmall organic molecule
Emp. Form.C26H29N3O5S
Mol. Mass.495.591
SMILESCCOC(=O)N1CCC(CC1)NS(=O)(=O)c1ccc(C(=O)Nc2ccccc2C)c2ccccc12