Reaction Details
TargetC-C chemokine receptor type 8
LigandBDBM50203891
Substrate/Competitorn/a
Meas. Tech.ChEMBL_425774 (CHEMBL855766)
IC50 20.4±n/a nM
Citation Jenkins, TJGuan, BDai, MLi, GLightburn, TEHuang, SFreeze, BSBurdi, DFJacutin-Porte, SBennett, RChen, WMinor, CGhosh, SBlackburn, CGigstad, KMJones, MKolbeck, RYin, WSmith, SCardillo, DOcain, TDHarriman, GC Design, synthesis, and evaluation of naphthalene-sulfonamide antagonists of human CCR8. J Med Chem50:566-84 (2007) 
 
C-C chemokine receptor type 8
Name:C-C chemokine receptor type 8
Type:PROTEIN
Mol. Mass.:40855.53
Organism:Homo sapiens (Human)
Description:ChEMBL_454278
Residue:355
BDBM50203891
NameBDBM50203891
Synonyms:CHEMBL221842 | N-(4-{[(1-butyrylpiperidin-4-yl)amino]sulfonyl}-1-naphthyl)-1-methyl-1H-imidazole-2-carboxamide
TypeSmall organic molecule
Emp. Form.C24H29N5O4S
Mol. Mass.483.583
SMILESCCCC(=O)N1CCC(CC1)NS(=O)(=O)c1ccc(NC(=O)c2nccn2C)c2ccccc12