Reaction Details
TargetC-C chemokine receptor type 8
LigandBDBM50203893
Substrate/Competitorn/a
Meas. Tech.ChEMBL_425774 (CHEMBL855766)
IC50 19.6±n/a nM
Citation Jenkins, TJGuan, BDai, MLi, GLightburn, TEHuang, SFreeze, BSBurdi, DFJacutin-Porte, SBennett, RChen, WMinor, CGhosh, SBlackburn, CGigstad, KMJones, MKolbeck, RYin, WSmith, SCardillo, DOcain, TDHarriman, GC Design, synthesis, and evaluation of naphthalene-sulfonamide antagonists of human CCR8. J Med Chem50:566-84 (2007) 
 
C-C chemokine receptor type 8
Name:C-C chemokine receptor type 8
Type:PROTEIN
Mol. Mass.:40855.53
Organism:Homo sapiens (Human)
Description:ChEMBL_454278
Residue:355
BDBM50203893
NameBDBM50203893
Synonyms:3-(2,6-dimethylmorpholin-4-yl)propyl-4-[({4-[(2-methylbenzoyl)amino]-1-naphthyl}sulfonyl)amino]piperidine-1-carboxylate | CHEMBL222020
TypeSmall organic molecule
Emp. Form.C33H42N4O6S
Mol. Mass.622.775
SMILESCC1CN(CCCOC(=O)N2CCC(CC2)NS(=O)(=O)c2ccc(NC(=O)c3ccccc3C)c3ccccc23)CC(C)O1