Reaction Details
TargetC-C chemokine receptor type 8
LigandBDBM50203928
Substrate/Competitorn/a
Meas. Tech.ChEMBL_425772 (CHEMBL855762)
Ki 37.9±n/a nM
Citation Jenkins, TJGuan, BDai, MLi, GLightburn, TEHuang, SFreeze, BSBurdi, DFJacutin-Porte, SBennett, RChen, WMinor, CGhosh, SBlackburn, CGigstad, KMJones, MKolbeck, RYin, WSmith, SCardillo, DOcain, TDHarriman, GC Design, synthesis, and evaluation of naphthalene-sulfonamide antagonists of human CCR8. J Med Chem50:566-84 (2007) 
 
C-C chemokine receptor type 8
Name:C-C chemokine receptor type 8
Type:PROTEIN
Mol. Mass.:40855.53
Organism:Homo sapiens (Human)
Description:ChEMBL_454278
Residue:355
BDBM50203928
NameBDBM50203928
Synonyms:CHEMBL221789 | ethyl 4-(1-(benzyloxy)naphthalene-4-sulfonamido)piperidine-1-carboxylate
TypeSmall organic molecule
Emp. Form.C25H28N2O5S
Mol. Mass.468.565
SMILESCCOC(=O)N1CCC(CC1)NS(=O)(=O)c1ccc(OCc2ccccc2)c2ccccc12