Reaction Details
TargetDelta-type opioid receptor
LigandBDBM26888
Substrate/Competitorn/a
Meas. Tech.ChEMBL_454477 (CHEMBL886503)
Ki 37890±n/a nM
Citation Caldwell, JPMatasi, JJZhang, HFawzi, ATulshian, DB Synthesis and structure-activity relationships of N-substituted spiropiperidines as nociceptin receptor ligands. Bioorg Med Chem Lett17:2281-4 (2007) 
 
Delta-type opioid receptor
Name:Delta-type opioid receptor
Type:G Protein-Coupled Receptor (GPCR)
Mol. Mass.:40382.98
Organism:Homo sapiens (Human)
Description:Competition binding assays were carried out using membrane preparations from transfected HN9.10 cells that constitutively expressed the delta opioid receptor.
Residue:372
BDBM26888
NameBDBM26888
Synonyms:8-(diphenylmethyl)-1-phenyl-1,3,8-triazaspiro[4.5]decan-4-one spiropiperidine analogue, 9
TypeSmall organic molecule
Emp. Form.C26H27N3O
Mol. Mass.397.5121
SMILESO=C1NCN(c2ccccc2)C11CCN(CC1)C(c1ccccc1)c1ccccc1